{"text_format":"1","workbook":"xlsx","n_sheets":7,"sheets":["Relatório de Atividades","BD Docentes","BD Disciplinas","BD Atividades","BD Listas","Filtro","BD PrevisãoOrçamentária"],"not_rendered":{"charts":0,"images":8,"macros":1,"external_links":0,"defined_names":13,"comments":0,"pivot_tables":0},"unopened":[],"bounds":{"document_bytes":16777216,"sheet_cells":100000,"rows_first":2000,"rows_last":500,"rows_between":2000,"halvings":0,"cell_chars":16384,"cell_head_chars":4096},"cells_cut":0,"cells_raw":0,"read":"whole","date_system":"1900"}

{"sheet":"Relatório de Atividades","index":0,"n_rows":137,"n_cols":15,"rows_kept":137,"cut":false,"hidden":false,"merged":[[70,3,70,6],[119,0,119,8],[120,0,120,7],[77,3,77,6],[95,0,95,9],[96,0,96,7],[86,3,86,6],[93,3,93,6],[94,3,94,6],[94,0,94,2],[109,3,109,6],[110,3,110,6],[101,3,101,6],[78,3,78,6],[102,3,102,6],[85,3,85,6],[88,0,88,7],[93,0,93,2],[122,4,122,6],[117,3,117,6],[118,3,118,6],[86,0,86,2],[85,0,85,2],[87,0,87,9],[71,0,71,9],[72,0,72,7],[111,0,111,9],[112,0,112,7],[115,0,115,2],[107,0,107,2],[101,0,101,2],[102,0,102,2],[103,0,103,9],[104,0,104,7],[109,0,109,2],[0,1,0,11],[33,4,33,5],[34,4,34,5],[33,8,33,9],[34,8,34,9],[2,4,2,6],[8,4,8,6],[18,3,18,6],[3,4,3,6],[5,4,5,6],[6,4,6,6],[7,4,7,6],[10,4,10,6],[19,4,19,5],[4,4,4,6],[11,3,11,6],[9,4,9,6],[34,0,34,2],[33,0,33,2],[14,3,14,4],[42,0,42,11],[50,0,50,11],[35,0,35,11],[45,0,45,11],[76,3,76,4],[40,8,40,9],[41,8,41,9],[69,3,69,6],[62,3,62,6],[57,6,57,11],[54,6,54,11],[48,3,48,4],[59,0,59,2],[64,0,64,7],[62,0,62,2],[61,0,61,2],[60,0,60,2],[51,0,51,10],[52,0,52,10],[36,0,36,10],[37,0,37,10],[43,0,43,10],[44,0,44,10],[55,5,55,10],[49,3,49,4],[63,0,63,9],[56,5,56,10],[135,6,136,11],[61,3,61,6],[124,7,126,8],[55,0,55,1],[56,0,56,1],[75,0,75,3],[77,0,77,2],[78,0,78,2],[79,0,79,9],[80,0,80,7],[67,0,67,2],[73,0,73,9],[69,0,69,2],[70,0,70,2],[136,2,138,5],[99,0,99,2],[91,0,91,2],[83,0,83,2],[117,0,117,2],[118,0,118,2],[110,0,110,2]]}
[null,{"$f":"E11","v":"Relatório p/ Progressão ou Promoção Funcional"}]
[]
[null,null,null,"SIAPE:"]
[null,null,null,"Docente:",{"$f":"IFERROR(VLOOKUP(E3,'BD Docentes'!A:B,2,),\"\")","v":""}]
[null,null,null,"Unidade:",{"$f":"IFERROR(VLOOKUP(E3,'BD Docentes'!A:G,7,), \"\")","v":""}]
[null,null,null,"Regime:",{"$f":"IFERROR(VLOOKUP(E3,'BD Docentes'!A:C,3,),\"\")","v":""}]
[null,null,null,"Classe:",{"$f":"IFERROR(VLOOKUP(E3,'BD Docentes'!A:D,4,),\"\")","v":""}]
[null,null,null,"Fone:",{"$f":"IFERROR(VLOOKUP(E3,'BD Docentes'!A:E,5,),\"\")","v":""}]
[null,null,null,"Email:",{"$f":"IFERROR(VLOOKUP(E3,'BD Docentes'!A:F,6,),\"\")","v":""}]
[null,null,null,"Vínculo:",{"$f":"IFERROR(VLOOKUP(E3,'BD Docentes'!A:H,8,),\"\")","v":""}]
[null,null,null,"Finalidade:","Relatório p/ Progressão ou Promoção Funcional"]
[null,null,null,"Desconsidere as pontuações"]
[null,null,null,"Ano"]
[]
[null,null,null,"Interstício para Progressão"]
[null,null,null,"Início","Fim"]
[]
[]
[null,null,null,"Inserir somente os semestres letivos com mais de 50% dos dias letivos cumpridos pelo docente.\n(Res.001/2008 UFCG/CSGAF Art.16 §2º)"]
[null,null,null,null,"Semestres (OBRIGATÓRIO)"]
[null,null,null,null,"Graduação","Pós-Grad."]
[]
[]
[]
[]
[]
[null,null,null,"Total",{"$f":"COUNTA(E22:E26)","v":0},{"$f":"COUNTA(F22:F26)","v":0}]
[]
[]
["Seção 1.1 (Ministração de Aulas - Exceto TCC e Estágio Supervisionado)"]
{"$rows_left_out":108}
{"sheet":"BD Docentes","index":1,"n_rows":89,"n_cols":10,"rows_kept":89,"cut":false,"hidden":true,"merged":[]}
["Siape","Nome","Regime","Classe","Fone","Email","UNIDADE","Vínculo","ID","88"]
[2056139,"ALEX BRUNO F. M. DO NASCIMENTO","T-40 - DE","Adjunto(a)","(83) 9 9656-5444","alexbruno.fmn@gmail.com","UAGESP","Efetivo",1]
[1187149,"ALLAN GUSTAVO FREIRE DA SILVA","T-40 - DE","Assistente","(83) 9 9966-3733","allangfs@hotmail.com","UAGESP","Efetivo",2]
[1451144,"ANTONIO DA SILVA CAMPOS JUNIOR","T-40 - DE","Adjunto(a)","(83) 9 9972-1535","junior.campos@uol.com.br","UAGESP","Efetivo",3]
[4496352,"GILVAN DIAS DE LIMA FILHO","T-40 - DE","Adjunto(a)","(83) 9 9618-7764","gilvandl@gmail.com","UAGESP","Efetivo",4]
[1325944,"JOSE IRIVALDO ALVES OLIVEIRA SILVA","T-40 - DE","Adjunto(a)","(83) 9 9982-4068","irivaldo.cdsa@gmail.com","UAGESP","Efetivo",5]
[1838740,"JOSÉ MARIA PEREIRA DA NÓBREGA JUNIOR","T-40 - DE","Associado(a)","(81) 9 8963-2841","nobrega.jr.ufpe@gmail.com","UAGESP","Efetivo",6]
[1314111,"KELLY CRISTINA COSTA SOARES","T-40 - DE","Adjunto(a)","(81) 9 9927-6003","kelsoares2016@uol.com.br","UAGESP","Efetivo",7]
[2489293,"LUIZ ANTÔNIO COELHO DA SILVA","T-40 - DE","Adjunto(a)","(83) 9 9822-8800","luidd@yahoo.com.br","UAGESP","Efetivo",8]
[1836148,"JOSÉ MARCIANO MONTEIRO","T-40 - DE","Adjunto(a)",null,"jm.monteiro17@gmail.com","UACIS","Efetivo",9]
[1840616,"JUNIA MARUSIA TRIGUEIRO DE LIMA","T-40 - DE","Adjunto(a)",null,"juniama@gmail.com","UACIS","Efetivo",10]
[1138045,"KÁTIA RAMOS SILVA","T-40 - DE","Adjunto(a)",null,"katya6@gmail.com","UACIS","Efetivo",11]
[3147774,"MARIA HELENA COSTA CARVALHO DE A. LIMA","T-40 - DE","Adjunto(a)",null,"lenacarvalho@gmail.com","UACIS","Efetivo",12]
[1569252,"PAULO CÉSAR OLIVEIRA DINIZ","T-40 - DE","Associado(a)","(83) 9 9843-0050","paulo.cesar@professor.ufcg.edu.br","UACIS","Efetivo",13]
[1071498,"ROZENVAL DE ALMEIDA E SOUSA","T-40 - DE","Adjunto(a)",null,"rozenval.estrela@gmail.com","UACIS","Efetivo",14]
[1435140,"VALDONILSON BARBOSA DOS SANTOS","T-40 - DE","Adjunto(a)","(83) 9 9968-6986","valdonilson.santos@uol.com.br","UACIS","Efetivo",15]
[2081790,"WALLACE GOMES FERREIRA DE SOUZA","T-40 - DE","Adjunto(a)","(83) 9 9622-5091","wallace.ferreiradesouza@gmail.com","UACIS","Efetivo",16]
[2317841,"ALDRE JORGE MORAIS DE BARROS","T-40 - DE","Adjunto(a)",null,"ajmbarros@yahoo.com.br","UAEB","Efetivo",17]
[1323519,"ANA MARY DA SILVA","T-40 - DE","Adjunto(a)",null,"aninha123@yahoo.com","UAEB","Efetivo",18]
[1624579,"ANA VERÔNICA SILVA DO NASCIMENTO","T-40 - DE","Adjunto(a)",null,"anaveronicasn@gmail.com","UAEB","Efetivo",19]
[2331779,"BRUNO RAFAEL PEREIRA NUNES","T-40 - DE","Adjunto(a)",null,"bruno.nunes@ufcg.edu.br","UAEB","Efetivo",20]
[1994682,"FRANKLIN FERREIRA DE FARIAS NOBREGA","T-40 - DE","Adjunto(a)",null,"franklinnobrega@yahoo.com.br","UAEB","Efetivo",21]
[2621135,"GEORGE DO NASCIMENTO RIBEIRO","T-40 - DE","Adjunto(a)",null,"georgenribeiro@gmail.com","UAEB","Efetivo",22]
[1786136,"GLAUCIANE DANUSA COELHO","T-40 - DE","Adjunto(a)",null,"glauciane.coelho.pb@gmail.com","UAEB","Efetivo",23]
[1867672,"JANDUY GUERRA ARAÚJO","T-40 - DE","Adjunto(a)",null,"janduy.guerra@gmail.com","UAEB","Efetivo",24]
[1785537,"JEAN CÉSAR FARIAS DE QUEIROZ","T-40 - DE","Adjunto(a)",null,"queiroz.jcf@gmail.com","UAEB","Efetivo",25]
[3143540,"JOSEDITE SARAIVA DE SOUZA","TEMPORÁRIO","TEMPORÁRIO",null,"prof.josedite@gmail.com","UAEB","TEMPORÁRIO",26]
[2301176,"LENILDE MERGIA RIBEIRO LIMA","T-40 - DE","Adjunto(a)",null,"mergia@gmail.com","UAEB","Efetivo",27]
[1994719,"MICHELLE ROSSANA FERREIRA VAZ","T-40 - DE","Adjunto(a)",null,"mrossanavaz@gmail.com","UAEB","Efetivo",28]
[337191,"RIVALDO VITAL DOS SANTOS","T-40 - DE","Titular",null,"rvital@cstr.ufcg.edu.br","UAEB","Efetivo",29]
{"$rows_left_out":60}
{"sheet":"BD Disciplinas","index":2,"n_rows":449,"n_cols":11,"rows_kept":449,"cut":false,"hidden":false,"merged":[]}
["Cód","codUnid","Disciplina","codun","hifen","Créditos","CH extrassala","Unidade","IDD",null,448]
[7101190,{"$f":"CONCATENATE(Tabela4[[#This Row],[Unidade]],Tabela4[[#This Row],[hifen]],Tabela4[[#This Row],[codun]])","v":"UAEDUC-7101"},"A EDUCACAO DA PESSOA SURDA",{"$f":"LEFT(Tabela4[[#This Row],[Cód]],4)","v":"7101"},"-",2,{"$f":"F2","v":2},"UAEDUC",1]
[7101051,{"$f":"CONCATENATE(Tabela4[[#This Row],[Unidade]],Tabela4[[#This Row],[hifen]],Tabela4[[#This Row],[codun]])","v":"UAEDUC-7101"},"AÇÃO COLETIVA,ASSOCIAT E COOPERATIVISMO",{"$f":"LEFT(Tabela4[[#This Row],[Cód]],4)","v":"7101"},"-",2,2,"UAEDUC",2]
[7102094,{"$f":"CONCATENATE(Tabela4[[#This Row],[Unidade]],Tabela4[[#This Row],[hifen]],Tabela4[[#This Row],[codun]])","v":"UATEC-7102"},"ADMINISTRAÇÃO E EMPREENDEDORISMO",{"$f":"LEFT(Tabela4[[#This Row],[Cód]],4)","v":"7102"},"-",2,2,"UATEC",3]
[7106047,{"$f":"CONCATENATE(Tabela4[[#This Row],[Unidade]],Tabela4[[#This Row],[hifen]],Tabela4[[#This Row],[codun]])","v":"UAGESP-7106"},"ADMINISTRAÇÃO ESTRATÉGICA",{"$f":"LEFT(Tabela4[[#This Row],[Cód]],4)","v":"7106"},"-",4,4,"UAGESP",4]
[7102266,{"$f":"CONCATENATE(Tabela4[[#This Row],[Unidade]],Tabela4[[#This Row],[hifen]],Tabela4[[#This Row],[codun]])","v":"UATEC-7102"},"AGRICULTURA DE PRECISAO",{"$f":"LEFT(Tabela4[[#This Row],[Cód]],4)","v":"7102"},"-",4,4,"UATEC",5]
[7102307,{"$f":"CONCATENATE(Tabela4[[#This Row],[Unidade]],Tabela4[[#This Row],[hifen]],Tabela4[[#This Row],[codun]])","v":"UATEC-7102"},"AGRICULTURA ORGÂNICA",{"$f":"LEFT(Tabela4[[#This Row],[Cód]],4)","v":"7102"},"-",2,2,"UATEC",6]
[7102086,{"$f":"CONCATENATE(Tabela4[[#This Row],[Unidade]],Tabela4[[#This Row],[hifen]],Tabela4[[#This Row],[codun]])","v":"UATEC-7102"},"AGROEC APLIC AO CULT DE PLANTAS ALIMENT",{"$f":"LEFT(Tabela4[[#This Row],[Cód]],4)","v":"7102"},"-",4,4,"UATEC",7]
[7102085,{"$f":"CONCATENATE(Tabela4[[#This Row],[Unidade]],Tabela4[[#This Row],[hifen]],Tabela4[[#This Row],[codun]])","v":"UATEC-7102"},"AGROEC APLIC AO CULTIVO DE FRUTIFERAS",{"$f":"LEFT(Tabela4[[#This Row],[Cód]],4)","v":"7102"},"-",2,2,"UATEC",8]
[7102082,{"$f":"CONCATENATE(Tabela4[[#This Row],[Unidade]],Tabela4[[#This Row],[hifen]],Tabela4[[#This Row],[codun]])","v":"UATEC-7102"},"AGROEC APLIC AO CULTIVO DE OLERICOLAS",{"$f":"LEFT(Tabela4[[#This Row],[Cód]],4)","v":"7102"},"-",4,4,"UATEC",9]
[7102063,{"$f":"CONCATENATE(Tabela4[[#This Row],[Unidade]],Tabela4[[#This Row],[hifen]],Tabela4[[#This Row],[codun]])","v":"UATEC-7102"},"AGROECOLOGIA",{"$f":"LEFT(Tabela4[[#This Row],[Cód]],4)","v":"7102"},"-",2,2,"UATEC",10]
[7102083,{"$f":"CONCATENATE(Tabela4[[#This Row],[Unidade]],Tabela4[[#This Row],[hifen]],Tabela4[[#This Row],[codun]])","v":"UATEC-7102"},"AGROECOLOGIA ANIMAL",{"$f":"LEFT(Tabela4[[#This Row],[Cód]],4)","v":"7102"},"-",4,4,"UATEC",11]
[7102067,{"$f":"CONCATENATE(Tabela4[[#This Row],[Unidade]],Tabela4[[#This Row],[hifen]],Tabela4[[#This Row],[codun]])","v":"UATEC-7102"},"AGROMETEOROLOGIA",{"$f":"LEFT(Tabela4[[#This Row],[Cód]],4)","v":"7102"},"-",4,4,"UATEC",12]
[7102010,{"$f":"CONCATENATE(Tabela4[[#This Row],[Unidade]],Tabela4[[#This Row],[hifen]],Tabela4[[#This Row],[codun]])","v":"UATEC-7102"},"ÁLGEBRA LINEAR",{"$f":"LEFT(Tabela4[[#This Row],[Cód]],4)","v":"7102"},"-",4,4,"UATEC",13]
[7102036,{"$f":"CONCATENATE(Tabela4[[#This Row],[Unidade]],Tabela4[[#This Row],[hifen]],Tabela4[[#This Row],[codun]])","v":"UATEC-7102"},"ANATO-FISIOLOGIA VEGETAL",{"$f":"LEFT(Tabela4[[#This Row],[Cód]],4)","v":"7102"},"-",4,4,"UATEC",14]
[7102068,{"$f":"CONCATENATE(Tabela4[[#This Row],[Unidade]],Tabela4[[#This Row],[hifen]],Tabela4[[#This Row],[codun]])","v":"UATEC-7102"},"ANATOMIA VEGETAL",{"$f":"LEFT(Tabela4[[#This Row],[Cód]],4)","v":"7102"},"-",2,2,"UATEC",15]
[7105088,{"$f":"CONCATENATE(Tabela4[[#This Row],[Unidade]],Tabela4[[#This Row],[hifen]],Tabela4[[#This Row],[codun]])","v":"UACIS-7105"},"ANTROPOLOGIA BRASILEIRA",{"$f":"LEFT(Tabela4[[#This Row],[Cód]],4)","v":"7105"},"-",2,2,"UACIS",16]
[7105192,{"$f":"CONCATENATE(Tabela4[[#This Row],[Unidade]],Tabela4[[#This Row],[hifen]],Tabela4[[#This Row],[codun]])","v":"UACIS-7105"},"ANTROPOLOGIA DA ARTE",{"$f":"LEFT(Tabela4[[#This Row],[Cód]],4)","v":"7105"},"-",2,2,"UACIS",17]
[7105001,{"$f":"CONCATENATE(Tabela4[[#This Row],[Unidade]],Tabela4[[#This Row],[hifen]],Tabela4[[#This Row],[codun]])","v":"UACIS-7105"},"ANTROPOLOGIA E EDUCAÇÃO",{"$f":"LEFT(Tabela4[[#This Row],[Cód]],4)","v":"7105"},"-",4,4,"UACIS",18]
[7102303,{"$f":"CONCATENATE(Tabela4[[#This Row],[Unidade]],Tabela4[[#This Row],[hifen]],Tabela4[[#This Row],[codun]])","v":"UATEC-7102"},"APICULTURA",{"$f":"LEFT(Tabela4[[#This Row],[Cód]],4)","v":"7102"},"-",4,4,"UATEC",19]
[7101123,{"$f":"CONCATENATE(Tabela4[[#This Row],[Unidade]],Tabela4[[#This Row],[hifen]],Tabela4[[#This Row],[codun]])","v":"UAEDUC-7101"},"ASPECT MORFOSSINTATICOS DA L PORTUGUESA",{"$f":"LEFT(Tabela4[[#This Row],[Cód]],4)","v":"7101"},"-",4,4,"UAEDUC",20]
[7101173,{"$f":"CONCATENATE(Tabela4[[#This Row],[Unidade]],Tabela4[[#This Row],[hifen]],Tabela4[[#This Row],[codun]])","v":"UAEDUC-7101"},"ASPECTOS SOCIOANTROPOLOGICOS DO ESPORTE",{"$f":"LEFT(Tabela4[[#This Row],[Cód]],4)","v":"7101"},"-",2,2,"UAEDUC",21]
[7101172,{"$f":"CONCATENATE(Tabela4[[#This Row],[Unidade]],Tabela4[[#This Row],[hifen]],Tabela4[[#This Row],[codun]])","v":"UAEDUC-7101"},"ATIVID ACADEMICO-CIENTIFICO-CULTURAIS",{"$f":"LEFT(Tabela4[[#This Row],[Cód]],4)","v":"7101"},"-",14,14,"UAEDUC",22]
[7105157,{"$f":"CONCATENATE(Tabela4[[#This Row],[Unidade]],Tabela4[[#This Row],[hifen]],Tabela4[[#This Row],[codun]])","v":"UACIS-7105"},"ATIVIDADES COMPLEMENTARES FLEXIVEIS",{"$f":"LEFT(Tabela4[[#This Row],[Cód]],4)","v":"7105"},"-",14,14,"UACIS",23]
[7102258,{"$f":"CONCATENATE(Tabela4[[#This Row],[Unidade]],Tabela4[[#This Row],[hifen]],Tabela4[[#This Row],[codun]])","v":"UATEC-7102"},"ATIVIDADES COMPLEMENTARES FLEXIVEIS",{"$f":"LEFT(Tabela4[[#This Row],[Cód]],4)","v":"7102"},"-",16,16,"UATEC",24]
[7102286,{"$f":"CONCATENATE(Tabela4[[#This Row],[Unidade]],Tabela4[[#This Row],[hifen]],Tabela4[[#This Row],[codun]])","v":"UATEC-7102"},"ATIVIDADES COMPLEMENTARES FLEXIVEIS",{"$f":"LEFT(Tabela4[[#This Row],[Cód]],4)","v":"7102"},"-",4,4,"UATEC",25]
[7102289,{"$f":"CONCATENATE(Tabela4[[#This Row],[Unidade]],Tabela4[[#This Row],[hifen]],Tabela4[[#This Row],[codun]])","v":"UATEC-7102"},"ATIVIDADES COMPLEMENTARES FLEXIVEIS",{"$f":"LEFT(Tabela4[[#This Row],[Cód]],4)","v":"7102"},"-",5,5,"UATEC",26]
[7102292,{"$f":"CONCATENATE(Tabela4[[#This Row],[Unidade]],Tabela4[[#This Row],[hifen]],Tabela4[[#This Row],[codun]])","v":"UATEC-7102"},"ATIVIDADES COMPLEMENTARES FLEXIVEIS",{"$f":"LEFT(Tabela4[[#This Row],[Cód]],4)","v":"7102"},"-",4,4,"UATEC",27]
[7106111,{"$f":"CONCATENATE(Tabela4[[#This Row],[Unidade]],Tabela4[[#This Row],[hifen]],Tabela4[[#This Row],[codun]])","v":"UAGESP-7106"},"AVALIAÇÃO DE POLÍTICAS PÚBLICAS",{"$f":"LEFT(Tabela4[[#This Row],[Cód]],4)","v":"7106"},"-",4,4,"UAGESP",28]
[7101091,{"$f":"CONCATENATE(Tabela4[[#This Row],[Unidade]],Tabela4[[#This Row],[hifen]],Tabela4[[#This Row],[codun]])","v":"UAEDUC-7101"},"AVALIAÇÃO DOS PROCESSOS EDUCACIONAIS",{"$f":"LEFT(Tabela4[[#This Row],[Cód]],4)","v":"7101"},"-",4,4,"UAEDUC",29]
{"$rows_left_out":420}
{"sheet":"BD Atividades","index":3,"n_rows":163,"n_cols":2,"rows_kept":163,"cut":false,"hidden":true,"merged":[[0,0,0,1]]}
["Seção 1.2(Demais atividades de ensino)"]
["Tipo de atividade","Pontos"]
["Escolha um item..."]
["1. Monografia",2.5]
["2. Estágio Curricular",2.5]
["3. TCC – Trabalho de Conclusão de Curso",2.5]
["4. Projetos Experimentais",2.5]
["5. Prática Jurídica",2.5]
["6. Prática Terapêutica",2.5]
["7. Outras atividades correlatas",2.5]
["8. Prática de Ensino",10]
[]
["Seção 2 (Produção intelectual)"]
["Tipo de atividade","Pontos"]
["Escolha um item..."]
["1. Livros técnico-científicos ou artístico-culturais publicados na área acadêmica, com autoria individual, aprovados por Conselho Editorial ou com registro ISBN",40]
["2. Livros técnico-científicos ou artístico-culturais publicados na área acadêmica, com mais de um autor, aprovados por Conselho Editorial ou com registro ISBN",30]
["3. Capítulos de livros técnico-científicos ou artístico-culturais publicados na área acadêmica, aprovados por Conselho Editorial ou com registro ISBN",10]
["4. Publicação de tradução de livro técnico-científico ou artístico-cultural, aprovada por Conselho Editorial ou com registro ISBN",15]
["5. Publicação de tradução de capítulo de livro técnico-científico ou artístico-cultural, aprovada por Conselho Editorial ou com registro ISBN",5]
["6. Publicação de tradução de artigo técnico-científico ou artístico-cultural, aprovada por Conselho Editorial",5]
["7. Artigos técnicos ou científicos publicados em periódicos indexados internacionalmente",20]
["8. Artigos técnicos ou científicos publicados em periódicos de circulação nacional",15]
["9. Artigos de divulgação científica, tecnológica, artística ou cultural publicados em periódicos especializados",10]
["10. Trabalhos completos publicados em anais de eventos internacionais",13]
["11. Trabalhos completos publicados em anais de eventos nacionais",8]
["12. Resumos publicados em anais de eventos internacionais",5]
["13. Resumos publicados em anais de eventos nacionais",3]
["14. Obras artísticas ou culturais premiadas internacionalmente",40]
["15. Obras artísticas ou culturais apresentadas ou publicadas internacionalmente",20]
{"$rows_left_out":134}
{"sheet":"BD Listas","index":4,"n_rows":22,"n_cols":11,"rows_kept":22,"cut":false,"hidden":true,"merged":[]}
["Escolha um curso...",null,null,"Unidade Ofertante",null,null,"semestre (graduação)","modo",null,null,"Prog.Promo?"]
["ST-Gestão Pública",null,null,"Escolha...",null,null,2020.3,"Remoto",null,null,"Escolha uma opção..."]
["ST-Agroecologia",null,null,"UAC!S",null,null,"2020.3","Remoto",null,null,"Relatório p/ Progressão ou Promoção Funcional"]
["Ciências Sociais",null,null,"UAEDUC",null,null,"2020-3","Remoto",null,null,"Relatório Anual de Atividades Docente"]
["Educação do Campo",null,null,"UAEB",null,null,"2020.1","Remoto",null,null,"Plano Anual de Atividades Docente"]
["Eng. da Produção",null,null,"UAEP",null,null,2020.1,"Remoto"]
["Eng. de Biossistemas",null,null,"UAGESP",null,null,"2020-1","Remoto"]
["Eng. de Biotec. e Bioproc.",null,null,"UATEC",null,null,"2020.1e","Remoto"]
[null,null,null,null,null,null,"2020,1e","Remoto"]
[null,null,null,null,null,null,"2020-1e","Remoto"]
[null,null,null,null,null,null,"2020.2","Remoto"]
[null,null,null,null,null,null,2020.2,"Remoto"]
[null,null,null,null,null,null,"2020-3","Remoto"]
[null,null,null,null,null,null,"2020.2e","Remoto"]
[null,null,null,null,null,null,"2020,2e","Remoto"]
[null,null,null,null,null,null,"2020-2e","Remoto"]
[null,null,null,null,null,null,"2021.1","Remoto"]
[null,null,null,null,null,null,2021.1,"Remoto"]
[null,null,null,null,null,null,"2021-1","Remoto"]
[null,null,null,null,null,null,"2021.1e","Remoto"]
[null,null,null,null,null,null,"2021,1e","Remoto"]
[null,null,null,null,null,null,"2021-1e","Remoto"]

{"sheet":"Filtro","index":5,"n_rows":449,"n_cols":9,"rows_kept":449,"cut":false,"hidden":true,"merged":[]}
["Cód","codUnid","Disciplina","codun","hifen","Créditos","CH extrassala","Unidade","ID"]
[7101190,"UAEDUC-7101","A EDUCACAO DA PESSOA SURDA","7101","-",2,2,"UAEDUC",1]
[7101051,"UAEDUC-7101","AÇÃO COLETIVA,ASSOCIAT E COOPERATIVISMO","7101","-",2,2,"UAEDUC",2]
[7102094,"UATEC-7102","ADMINISTRAÇÃO E EMPREENDEDORISMO","7102","-",2,2,"UATEC",3]
[7106047,"UAGESP-7106","ADMINISTRAÇÃO ESTRATÉGICA","7106","-",4,4,"UAGESP",4]
[7102266,"UATEC-7102","AGRICULTURA DE PRECISAO","7102","-",4,4,"UATEC",5]
[7102307,"UATEC-7102","AGRICULTURA ORGÂNICA","7102","-",2,2,"UATEC",6]
[7102086,"UATEC-7102","AGROEC APLIC AO CULT DE PLANTAS ALIMENT","7102","-",4,4,"UATEC",7]
[7102085,"UATEC-7102","AGROEC APLIC AO CULTIVO DE FRUTIFERAS","7102","-",2,2,"UATEC",8]
[7102082,"UATEC-7102","AGROEC APLIC AO CULTIVO DE OLERICOLAS","7102","-",4,4,"UATEC",9]
[7102063,"UATEC-7102","AGROECOLOGIA","7102","-",2,2,"UATEC",10]
[7102083,"UATEC-7102","AGROECOLOGIA ANIMAL","7102","-",4,4,"UATEC",11]
[7102067,"UATEC-7102","AGROMETEOROLOGIA","7102","-",4,4,"UATEC",12]
[7102010,"UATEC-7102","ÁLGEBRA LINEAR","7102","-",4,4,"UATEC",13]
[7102036,"UATEC-7102","ANATO-FISIOLOGIA VEGETAL","7102","-",4,4,"UATEC",14]
[7102068,"UATEC-7102","ANATOMIA VEGETAL","7102","-",2,2,"UATEC",15]
[7105088,"UACIS-7105","ANTROPOLOGIA BRASILEIRA","7105","-",2,2,"UACIS",16]
[7105192,"UACIS-7105","ANTROPOLOGIA DA ARTE","7105","-",2,2,"UACIS",17]
[7105001,"UACIS-7105","ANTROPOLOGIA E EDUCAÇÃO","7105","-",4,4,"UACIS",18]
[7102303,"UATEC-7102","APICULTURA","7102","-",4,4,"UATEC",19]
[7101123,"UAEDUC-7101","ASPECT MORFOSSINTATICOS DA L PORTUGUESA","7101","-",4,4,"UAEDUC",20]
[7101173,"UAEDUC-7101","ASPECTOS SOCIOANTROPOLOGICOS DO ESPORTE","7101","-",2,2,"UAEDUC",21]
[7101172,"UAEDUC-7101","ATIVID ACADEMICO-CIENTIFICO-CULTURAIS","7101","-",14,14,"UAEDUC",22]
[7105157,"UACIS-7105","ATIVIDADES COMPLEMENTARES FLEXIVEIS","7105","-",14,14,"UACIS",23]
[7102258,"UATEC-7102","ATIVIDADES COMPLEMENTARES FLEXIVEIS","7102","-",16,16,"UATEC",24]
[7102286,"UATEC-7102","ATIVIDADES COMPLEMENTARES FLEXIVEIS","7102","-",4,4,"UATEC",25]
[7102289,"UATEC-7102","ATIVIDADES COMPLEMENTARES FLEXIVEIS","7102","-",5,5,"UATEC",26]
[7102292,"UATEC-7102","ATIVIDADES COMPLEMENTARES FLEXIVEIS","7102","-",4,4,"UATEC",27]
[7106111,"UAGESP-7106","AVALIAÇÃO DE POLÍTICAS PÚBLICAS","7106","-",4,4,"UAGESP",28]
[7101091,"UAEDUC-7101","AVALIAÇÃO DOS PROCESSOS EDUCACIONAIS","7101","-",4,4,"UAEDUC",29]
{"$rows_left_out":420}
{"sheet":"BD PrevisãoOrçamentária","index":6,"n_rows":5,"n_cols":1,"rows_kept":5,"cut":false,"hidden":true,"merged":[]}
["Diárias"]
["Passagens aéreas"]
["Inscrição"]
["Aquisição de materiais"]
["Outros serviços"]